BDBM50270340 (2R,3S,4S,5R)-2-(hydroxymethyl)-5-(((S)-1-(4-methoxyphenyl)ethylamino)methyl)-tetrahydrofuran-3,4-diol::CHEMBL445199
SMILES COc1ccc(cc1)[C@H](C)NC[C@H]1O[C@H](CO)[C@@H](O)[C@@H]1O
InChI Key InChIKey=IJIOCMGDILNHSX-JZLHEVAFSA-N
Data  1 IC50
  Tab Delimited (TSV)   2D SDfile   Computed 3D by Vconf -m prep SDfile
Find this compound or compounds like it in BindingDB:
Activity Spreadsheet -- Enzyme Inhibition Constant Data from BindingDB
Found 1 hit for monomerid = 50270340
TargetPyruvate kinase(Leishmania mexicana)
University Of Edinburgh
Curated by ChEMBL
LigandPNGBDBM50270340((2R,3S,4S,5R)-2-(hydroxymethyl)-5-(((S)-1-(4-metho...)
Affinity DataIC50:  3.50E+6nM. Assay description: Inhibition of Leishmania mexicana pyruvate kinase
In DepthDetails ArticlePubMed