BDBM50270524 2-(4-(3-chloro-4-(pyridin-2-ylmethoxy)phenylamino)quinazolin-5-yloxy)-2-methylpropanamide::CHEMBL518750
SMILES CC(C)(Oc1cccc2ncnc(Nc3ccc(OCc4ccccn4)c(Cl)c3)c12)C(N)=O
InChI Key InChIKey=ZTDGISKEIHFQJM-UHFFFAOYSA-N
Data  1 IC50
  Tab Delimited (TSV)   2D SDfile   Computed 3D by Vconf -m prep SDfile
Find this compound or compounds like it in BindingDB:
Activity Spreadsheet -- Enzyme Inhibition Constant Data from BindingDB
Found 1 hit for monomerid = 50270524
TargetReceptor tyrosine-protein kinase erbB-2(Homo sapiens (Human))
University Of Southern California
Curated by ChEMBL
LigandPNGBDBM50270524(2-(4-(3-chloro-4-(pyridin-2-ylmethoxy)phenylamino)...)
Affinity DataIC50:  2nM. Assay description: Inhibition of HER2 (unknown origin)
In DepthDetails ArticlePubMed