BDBM50270529 3-Bromo-7-iodo-1H-indazole::CHEMBL456579
SMILES Brc1n[nH]c2c(I)cccc12
InChI Key InChIKey=CSVJSYJEYYTJPV-UHFFFAOYSA-N
Data  3 IC50
  Tab Delimited (TSV)   2D SDfile   Computed 3D by Vconf -m prep SDfile
Find this compound or compounds like it in BindingDB:
Activity Spreadsheet -- Enzyme Inhibition Constant Data from BindingDB
Found 3 hits for monomerid = 50270529
TargetNitric oxide synthase, brain(Rattus norvegicus (rat))
Université
Curated by ChEMBL
LigandPNGBDBM50270529(3-Bromo-7-iodo-1H-indazole | CHEMBL456579)
Affinity DataIC50:  7.50E+5nM. Assay description: Inhibition of rat brain recombinant nNOS
In DepthDetails ArticlePubMed
TargetNitric oxide synthase, endothelial(Bos taurus (bovine))
Université
Curated by ChEMBL
LigandPNGBDBM50270529(3-Bromo-7-iodo-1H-indazole | CHEMBL456579)
Affinity DataIC50:  5.00E+5nM. Assay description: Inhibition of bovine recombinant eNOS
In DepthDetails ArticlePubMed
TargetNitric oxide synthase, inducible(Mus musculus (mouse))
Université
Curated by ChEMBL
LigandPNGBDBM50270529(3-Bromo-7-iodo-1H-indazole | CHEMBL456579)
Affinity DataIC50:  9.00E+5nM. Assay description: Inhibition of mouse recombinant iNOS
In DepthDetails ArticlePubMed