BDBM50270560 2-[(Imidazolidin-2-yl)imino]-5-methylindazole hydrochloride::CHEMBL447135
SMILES [#6]-c1ccc2nn(cc2c1)\[#7]=[#6]-1/[#7]-[#6]-[#6]-[#7]-1
InChI Key InChIKey=LEEUZTXIUPYEHT-UHFFFAOYSA-N
Data  1 IC50
  Tab Delimited (TSV)   2D SDfile   Computed 3D by Vconf -m prep SDfile
Find this compound or compounds like it in BindingDB:
Activity Spreadsheet -- Enzyme Inhibition Constant Data from BindingDB
Found 1 hit for monomerid = 50270560
TargetNischarin(RAT)
Medical University Of Gda£?Sk
Curated by ChEMBL
LigandPNGBDBM50270560(2-[(Imidazolidin-2-yl)imino]-5-methylindazole hydr...)
Affinity DataIC50:  1.34E+4nM. Assay description: Displacement of [3H]clonidine from imidazoline 1 receptor in Sprague-Dawley rat kidney
In DepthDetails ArticlePubMed