BDBM50270760 CHEMBL4127550
SMILES NC(=O)C(Sc1nc(-c2cccc(OC(F)(F)F)c2)c(C#N)c(=O)[nH]1)c1nc(cs1)-c1ccccc1
InChI Key InChIKey=RSEMEVAKLMUFHR-UHFFFAOYSA-N
Data  1 IC50  1 Kd
  Tab Delimited (TSV)   2D SDfile   Computed 3D by Vconf -m prep SDfile
Find this compound or compounds like it in BindingDB:
Activity Spreadsheet -- Enzyme Inhibition Constant Data from BindingDB
Found 2 hits for monomerid = 50270760
TargetBeta-secretase 1(Homo sapiens (Human))
Peking University Health Science Center
Curated by ChEMBL
LigandPNGBDBM50270760(CHEMBL4127550)
Affinity DataKd:  1.88E+3nM. Assay description: Binding affinity to BACE1 (unknown origin) by SPR method
In DepthDetails ArticlePubMed
TargetBeta-secretase 1(Homo sapiens (Human))
Peking University Health Science Center
Curated by ChEMBL
LigandPNGBDBM50270760(CHEMBL4127550)
Affinity DataIC50:  2.96E+4nM. Assay description: Inhibition of BACE1 (unknown origin) using Rh-EVNLDAEFK-Quencher as substrate after 60 mins by FRET assay
In DepthDetails ArticlePubMed