BDBM50270765 CHEMBL4127289
SMILES COc1cccc(c1)-c1nc(SC(C(N)=O)c2nc(cs2)-c2cccc(c2)[N+]([O-])=O)[nH]c(=O)c1C#N
InChI Key InChIKey=TYVOJIBSOUPZJX-UHFFFAOYSA-N
Data  1 IC50  1 Kd
  Tab Delimited (TSV)   2D SDfile   Computed 3D by Vconf -m prep SDfile
Find this compound or compounds like it in BindingDB:
Activity Spreadsheet -- Enzyme Inhibition Constant Data from BindingDB
Found 2 hits for monomerid = 50270765
TargetBeta-secretase 1(Homo sapiens (Human))
Peking University Health Science Center
Curated by ChEMBL
LigandPNGBDBM50270765(CHEMBL4127289)
Affinity DataKd:  1.75E+3nM. Assay description: Binding affinity to BACE1 (unknown origin) by SPR method
In DepthDetails ArticlePubMed
TargetBeta-secretase 1(Homo sapiens (Human))
Peking University Health Science Center
Curated by ChEMBL
LigandPNGBDBM50270765(CHEMBL4127289)
Affinity DataIC50:  2.43E+4nM. Assay description: Inhibition of BACE1 (unknown origin) using Rh-EVNLDAEFK-Quencher as substrate after 60 mins by FRET assay
In DepthDetails ArticlePubMed