BDBM50270818 (2S)-1-{2-[(2S)-2-[(2S)-2-{[(2S)-1-[(2S)-2-[(2S)-2-(2-{2-[(2S)-2-[(2S)-2-{2-[(2S,3R)-2-[(2R)-2-[(2S)-2-[(2S)-2-[(2S)-2-amino-4-carbamoylbutanamido]-5-carbamimidamidopentanamido]-3-phenylpropanamido]-3-methyl-3-sulfanylbutanamido]-3-hydroxybutanamido]acetamido}-3-(1H-imidazol-5-yl)propanamido]-3-phenylpropanamido]acetamido}acetamido)-4-methylpentanamido]-3-(4-hydroxyphenyl)propanoyl]pyrrolidin-2-yl]formamido}-4-sulfanylbutanamido]-3-carbamoylpropanamido]acetyl}pyrrolidine-2-carboxylic acid::CHEMBL499766
SMILES CC(C)C[C@H](NC(=O)CNC(=O)CNC(=O)[C@H](Cc1ccccc1)NC(=O)[C@H](Cc1cnc[nH]1)NC(=O)CNC(=O)[C@@H](NC(=O)[C@@H](NC(=O)[C@H](Cc1ccccc1)NC(=O)[C@H](CCCN=C(N)N)NC(=O)[C@@H](N)CCC(N)=O)C(C)(C)S)[C@@H](C)O)C(=O)N[C@@H](Cc1ccc(O)cc1)C(=O)N1CCC[C@H]1C(=O)N[C@@H](CCS)C(=O)N[C@@H](CC(N)=O)C(=O)NCC(=O)N1CCC[C@H]1C(O)=O
InChI Key InChIKey=QHXJCRJQOLHTCU-PUBHSFPPSA-N
Data  1 IC50  1 Kd
  Tab Delimited (TSV)   2D SDfile   Computed 3D by Vconf -m prep SDfile
Find this compound or compounds like it in BindingDB:
Activity Spreadsheet -- Enzyme Inhibition Constant Data from BindingDB
Found 2 hits for monomerid = 50270818
TargetIgG receptor FcRn large subunit p51(Homo sapiens (Human))
Syntonix Pharmaceuticals
Curated by ChEMBL
LigandPNGBDBM50270818((2S)-1-{2-[(2S)-2-[(2S)-2-{[(2S)-1-[(2S)-2-[(2S)-2...)
Affinity DataKd:  310nMpH: 6.0Assay Description:Binding affinity to human FcRn at pH 6 by surface plasmon resonance assay
In DepthDetails ArticlePubMed
TargetIgG receptor FcRn large subunit p51(Homo sapiens (Human))
Syntonix Pharmaceuticals
Curated by ChEMBL
LigandPNGBDBM50270818((2S)-1-{2-[(2S)-2-[(2S)-2-{[(2S)-1-[(2S)-2-[(2S)-2...)
Affinity DataIC50:  2.00E+3nM. Assay description: Inhibition of human IgG binding to soluble human FcRn by ELISA
In DepthDetails ArticlePubMed