BDBM50270962 (2R)-2-{[(2S)-1-[(2S)-2-[(2S)-2-{[(3S,6R)-6-[(2S)-2-[(2S)-2-{2-[(2S,3R)-2-[(2S)-2-[(2S)-2-[(2S)-2-amino-5-carbamimidamidopentanamido]-3-phenylpropanamido]-3-methyl-3-sulfanylbutanamido]-3-hydroxybutanamido]acetamido}-3-(1H-imidazol-5-yl)propanamido]-3-phenylpropanamido]-5-oxo-hexahydropyrrolo[2,1-b][1,3]thiazol-3-yl]formamido}-4-methylpentanamido]-3-(4-hydroxyphenyl)propanoyl]pyrrolidin-2-yl]formamido}-3-sulfanylpropanoic acid::CHEMBL504539
SMILES CC(C)C[C@H](NC(=O)[C@H]1CSC2C[C@@H](NC(=O)[C@H](Cc3ccccc3)NC(=O)[C@H](Cc3cnc[nH]3)NC(=O)CNC(=O)[C@@H](NC(=O)[C@H](NC(=O)[C@H](Cc3ccccc3)NC(=O)[C@@H](N)CCCN=C(N)N)C(C)(C)S)[C@@H](C)O)C(=O)N12)C(=O)N[C@@H](Cc1ccc(O)cc1)C(=O)N1CCC[C@H]1C(=O)N[C@@H](CS)C(O)=O
InChI Key InChIKey=FEZKMFDXZVPPPA-VIMAYOAJSA-N
Data  1 IC50  1 Kd
  Tab Delimited (TSV)   2D SDfile   Computed 3D by Vconf -m prep SDfile
Find this compound or compounds like it in BindingDB:
Activity Spreadsheet -- Enzyme Inhibition Constant Data from BindingDB
Found 2 hits for monomerid = 50270962
TargetIgG receptor FcRn large subunit p51(Homo sapiens (Human))
Syntonix Pharmaceuticals
Curated by ChEMBL
LigandPNGBDBM50270962((2R)-2-{[(2S)-1-[(2S)-2-[(2S)-2-{[(3S,6R)-6-[(2S)-...)
Affinity DataKd:  990nMpH: 6.0Assay Description:Binding affinity to human FcRn at pH 6 by surface plasmon resonance assay
In DepthDetails ArticlePubMed
TargetIgG receptor FcRn large subunit p51(Homo sapiens (Human))
Syntonix Pharmaceuticals
Curated by ChEMBL
LigandPNGBDBM50270962((2R)-2-{[(2S)-1-[(2S)-2-[(2S)-2-{[(3S,6R)-6-[(2S)-...)
Affinity DataIC50:  1.30E+4nM. Assay description: Inhibition of human IgG binding to soluble human FcRn by ELISA
In DepthDetails ArticlePubMed