BDBM50271149 CHEMBL4125781
SMILES C[C@H]1CN(C[C@@H](C)N1)C(=O)c1cc(C2CCCN2c2cc(F)cc(F)c2)c2nc(cnc2c1)N1CCOCC1
InChI Key InChIKey=ICFUXSFIXHYYTR-ULZZTYQWSA-N
Data  2 IC50  5 Kd
  Tab Delimited (TSV)   2D SDfile   Computed 3D by Vconf -m prep SDfile
Find this compound or compounds like it in BindingDB:
Activity Spreadsheet -- Enzyme Inhibition Constant Data from BindingDB
Found 7 hits for monomerid = 50271149
TargetPhosphatidylinositol 4,5-bisphosphate 3-kinase catalytic subunit beta isoform(Homo sapiens (Human))
Therachem Research Medilab (India)
Curated by ChEMBL
LigandPNGBDBM50271149(CHEMBL4125781)
Affinity DataIC50:  5nM. Assay description: Inhibition of PI3Kbeta in human PC3 cells assessed as reduction in AKT phosphorylation at Thr308 residue measured after 60 mins by ELISA
In DepthDetails ArticlePubMed
TargetPhosphatidylinositol 4,5-bisphosphate 3-kinase catalytic subunit alpha isoform(Homo sapiens (Human))
Therachem Research Medilab (India)
Curated by ChEMBL
LigandPNGBDBM50271149(CHEMBL4125781)
Affinity DataKd:  14nM. Assay description: Binding affinity to wild-type human PIK3Calpha (R108 to N1068 residues) expressed in mammalian expression system by KINOMEScan assay
In DepthDetails ArticlePubMed
TargetPhosphatidylinositol 4,5-bisphosphate 3-kinase catalytic subunit beta isoform(Homo sapiens (Human))
Therachem Research Medilab (India)
Curated by ChEMBL
LigandPNGBDBM50271149(CHEMBL4125781)
Affinity DataKd:  0.200nM. Assay description: Binding affinity to wild-type human PIK3Cbeta (P118 to S1070 residues) expressed in mammalian expression system by KINOMEScan assay
In DepthDetails ArticlePubMed
TargetPhosphatidylinositol 4,5-bisphosphate 3-kinase catalytic subunit delta isoform(Homo sapiens (Human))
Therachem Research Medilab (India)
Curated by ChEMBL
LigandPNGBDBM50271149(CHEMBL4125781)
Affinity DataKd:  7nM. Assay description: Binding affinity to wild-type human PIK3Cdelta (R108 to Q1044 residues) expressed in mammalian expression system by KINOMEScan assay
In DepthDetails ArticlePubMed
TargetSerine/threonine-protein kinase mTOR(Homo sapiens (Human))
Therachem Research Medilab (India)
Curated by ChEMBL
LigandPNGBDBM50271149(CHEMBL4125781)
Affinity DataKd: >3.02E+4nM. Assay description: Binding affinity to wild-type human MTOR (L1382 to W2549 residues) expressed in mammalian expression system by KINOMEScan assay
In DepthDetails ArticlePubMed
TargetPhosphatidylinositol 4,5-bisphosphate 3-kinase catalytic subunit beta isoform(Homo sapiens (Human))
Therachem Research Medilab (India)
Curated by ChEMBL
LigandPNGBDBM50271149(CHEMBL4125781)
Affinity DataIC50:  7nM. Assay description: Inhibition of PI3Kbeta in human PC3 cells assessed as reduction in AKT phosphorylation at S473 residue measured after 60 mins by ELISA
In DepthDetails ArticlePubMed
TargetPhosphatidylinositol 4,5-bisphosphate 3-kinase catalytic subunit gamma isoform(Homo sapiens (Human))
Therachem Research Medilab (India)
Curated by ChEMBL
LigandPNGBDBM50271149(CHEMBL4125781)
Affinity DataKd:  214nM. Assay description: Binding affinity to wild-type human PIK3Cgamma (S144 to A1102 residues) expressed in mammalian expression system by KINOMEScan assay
In DepthDetails ArticlePubMed