BDBM50271316 CHEMBL482699::N-(3-{[3-(1-Imino-ethyl)-benzylamino]-methyl}-phenyl)-acetamidine
SMILES CC(=N)Nc1cccc(CNCc2cccc(c2)C(C)=N)c1
InChI Key InChIKey=QPWHVQLRYUADTC-UHFFFAOYSA-N
Data  1 KI
  Tab Delimited (TSV)   2D SDfile   Computed 3D by Vconf -m prep SDfile
Find this compound or compounds like it in BindingDB:
Activity Spreadsheet -- Enzyme Inhibition Constant Data from BindingDB
Found 1 hit for monomerid = 50271316
TargetNitric oxide synthase, brain(Homo sapiens (Human))
Instituto De QuíMica MéDica
Curated by ChEMBL
LigandPNGBDBM50271316(CHEMBL482699 | N-(3-{[3-(1-Imino-ethyl)-benzylamin...)
Affinity DataKi:  42nM. Assay description: Inhibition of nNOS (unknown origin) assessed as conversion of L-[3H]arginine to L-[3H]citrulline
In DepthDetails ArticlePubMed