BDBM50271623 1-[4-Chlorophenylcarbonyl]-4-[4-(imidazol-1-yl)phenylmethyl]-piperazine::CHEMBL484322
SMILES Clc1ccc(cc1)C(=O)N1CCN(Cc2ccc(cc2)-n2ccnc2)CC1
InChI Key InChIKey=JWVAMUPSPZLZSM-UHFFFAOYSA-N
Data  1 IC50
  Tab Delimited (TSV)   2D SDfile   Computed 3D by Vconf -m prep SDfile
Find this compound or compounds like it in BindingDB:
Activity Spreadsheet -- Enzyme Inhibition Constant Data from BindingDB
Found 1 hit for monomerid = 50271623
TargetLanosterol synthase(Homo sapiens (Human))
Laboratoire Glaxosmithkline
Curated by ChEMBL
LigandPNGBDBM50271623(1-[4-Chlorophenylcarbonyl]-4-[4-(imidazol-1-yl)phe...)
Affinity DataIC50:  32nM. Assay description: Inhibition of 2,3-oxidosqualene-lanosterol cyclase (unknown origin)
In DepthDetails ArticlePubMed