BDBM50271986 CHEMBL4129882
SMILES CC(C)(c1cnc(SCCOCc2ccc(cc2)-c2nnn[nH]2)n1-c1ccc(F)cc1)c1ccc(Cl)c(Cl)c1
InChI Key InChIKey=BHONMGUVTACYBP-UHFFFAOYSA-N
Data  1 EC50
  Tab Delimited (TSV)   2D SDfile   Computed 3D by Vconf -m prep SDfile
Find this compound or compounds like it in BindingDB:
Activity Spreadsheet -- Enzyme Inhibition Constant Data from BindingDB
Found 1 hit for monomerid = 50271986
TargetG-protein coupled bile acid receptor 1(Homo sapiens (Human))
Cadila Healthcare
Curated by ChEMBL
LigandPNGBDBM50271986(CHEMBL4129882)
Affinity DataEC50: >1.00E+3nM. Assay description: Agonist activity at human TGR5 expressed in CHOK1 cells after 5 hrs by luciferase reporter gene assay
In DepthDetails ArticlePubMed