BDBM50272145 (2S,5S)-1-((S)-3-Mercapto-2-methyl-propionyl)-5-(3-methyl-benzylsulfanyl)-pyrrolidine-2-carboxylic acid::CHEMBL499612
SMILES C[C@H](CS)C(=O)N1[C@H](CC[C@H]1C(O)=O)SCc1cccc(C)c1
InChI Key InChIKey=OWXUTBHOMWWGRA-SNPRPXQTSA-N
Data  2 IC50
  Tab Delimited (TSV)   2D SDfile   Computed 3D by Vconf -m prep SDfile
Find this compound or compounds like it in BindingDB:
Activity Spreadsheet -- Enzyme Inhibition Constant Data from BindingDB
Found 2 hits for monomerid = 50272145
TargetAngiotensin-converting enzyme(Homo sapiens (Human))
Santen Pharmaceutical
Curated by ChEMBL
LigandPNGBDBM50272145((2S,5S)-1-((S)-3-Mercapto-2-methyl-propionyl)-5-(3...)
Affinity DataIC50:  0.900nM. Assay description: Inhibition of ACE (unknown origin)
In DepthDetails ArticlePubMed
TargetLeukotriene A-4 hydrolase(Cavia porcellus)
Santen Pharmaceutical
Curated by ChEMBL
LigandPNGBDBM50272145((2S,5S)-1-((S)-3-Mercapto-2-methyl-propionyl)-5-(3...)
Affinity DataIC50: >1.00E+4nM. Assay description: Inhibition of guinea pig lung leukotriene A4 hydrolase
In DepthDetails ArticlePubMed