BDBM50272280 CHEMBL4127165
SMILES Cc1ccc(cc1)S(=O)(=O)N[C@@H](C1CCCCC1)C(=O)Nc1ccc(cc1)C(N)=N
InChI Key InChIKey=PBUFMZMUQKRGQZ-FQEVSTJZSA-N
Data  1 IC50
  Tab Delimited (TSV)   2D SDfile   Computed 3D by Vconf -m prep SDfile
Find this compound or compounds like it in BindingDB:
Activity Spreadsheet -- Enzyme Inhibition Constant Data from BindingDB
Found 1 hit for monomerid = 50272280
TargetSerine protease hepsin(Homo sapiens (Human))
University Of Helsinki
Curated by ChEMBL
LigandPNGBDBM50272280(CHEMBL4127165)
Affinity DataIC50:  220nM. Assay description: Inhibition of recombinant C-terminal His10-tagged human Hepsin (R45 to L17 residues) D161E/ R162K double mutant expressed in mouse NS0 cells using Bo...
In DepthDetails ArticlePubMed