BDBM50272380 (2S,3R,4S,5R,6R)-2-((2R,3S,4R,5R,6S)-6-(6-((2R,3S,4S,5R,6S)-3,4-dihydroxy-6-(hydroxymethyl)-5-((2R,3S,4R,5S,6S)-3,4,5-trihydroxy-6-(hydroxymethyl)-tetrahydro-2H-pyran-2-yloxy)-tetrahydro-2H-pyran-2-ylthio)hexa-2,4-diynylthio)-4,5-dihydroxy-2-(hydroxymethyl)-tetrahydro-2H-pyran-3-yloxy)-6-(hydroxymethyl)-tetrahydro-2H-pyran-3,4,5-triol::CHEMBL449603
SMILES OC[C@H]1O[C@@H](O[C@@H]2[C@@H](CO)O[C@@H](SCC#CC#CCS[C@H]3O[C@@H](CO)[C@H](O[C@H]4O[C@@H](CO)[C@@H](O)[C@@H](O)[C@@H]4O)[C@@H](O)[C@@H]3O)[C@H](O)[C@H]2O)[C@H](O)[C@@H](O)[C@H]1O
InChI Key InChIKey=SPEGHNKFRDVZSX-LVADKVNVSA-N
Data  2 IC50
  Tab Delimited (TSV)   2D SDfile   Computed 3D by Vconf -m prep SDfile
Find this compound or compounds like it in BindingDB:
Activity Spreadsheet -- Enzyme Inhibition Constant Data from BindingDB
Found 2 hits for monomerid = 50272380
TargetGalectin-1(Homo sapiens (Human))
Universit£
Curated by ChEMBL
LigandPNGBDBM50272380((2S,3R,4S,5R,6R)-2-((2R,3S,4R,5R,6S)-6-(6-((2R,3S,...)
Affinity DataIC50:  3.00E+5nM. Assay description: Inhibition of recombinant galectin 1 in human O type red blood cells by hemagglutination assay
In DepthDetails ArticlePubMed
TargetGalectin-3(Homo sapiens (Human))
Universit£
Curated by ChEMBL
LigandPNGBDBM50272380((2S,3R,4S,5R,6R)-2-((2R,3S,4R,5R,6S)-6-(6-((2R,3S,...)
Affinity DataIC50:  1.60E+5nM. Assay description: Inhibition of recombinant galectin 3 in human O type red blood cells by hemagglutination assay
In DepthDetails ArticlePubMed