BDBM50272608 CHEMBL4125688
SMILES Cl.Cl.C[C@@H](N[C@@H]1CCN(C1)c1cccc(c1)C(F)(F)F)c1cccc2ccccc12
InChI Key InChIKey=ULEHRDTVDTULBQ-NMWSZSNKSA-N
Data  1 IC50  1 EC50
  Tab Delimited (TSV)   2D SDfile   Computed 3D by Vconf -m prep SDfile
Find this compound or compounds like it in BindingDB:
Activity Spreadsheet -- Enzyme Inhibition Constant Data from BindingDB
Found 2 hits for monomerid = 50272608
TargetExtracellular calcium-sensing receptor(Homo sapiens (Human))
Mitsubishi Tanabe Pharma
Curated by ChEMBL
LigandPNGBDBM50272608(CHEMBL4125688)
Affinity DataEC50:  430nM. Assay description: Agonist activity at human CaSR expressed in CHO cells assessed as increase in intracellular calcium mobilization after 1 hr by Fura-2 dye-based fluor...
In DepthDetails ArticlePubMed
TargetExtracellular calcium-sensing receptor(Rattus norvegicus)
Mitsubishi Tanabe Pharma
Curated by ChEMBL
LigandPNGBDBM50272608(CHEMBL4125688)
Affinity DataIC50:  9.70nM. Assay description: Agonist activity at CaSR in rat parathyroid cells assessed as inhibition of PTH (1 to 84 residues) production in presence of Cacl2 by ELISA
In DepthDetails ArticlePubMed