BDBM50273412 3-Cyclohexyl-1-[4-methoxy-3-(tetrahydrofuran-3-yloxy)phenyl]propan-1-one::CHEMBL456327
SMILES COc1ccc(cc1OC1CCOC1)C(=O)CCC1CCCCC1
InChI Key InChIKey=HKRINOXVCHQASS-UHFFFAOYSA-N
Data  3 IC50
  Tab Delimited (TSV)   2D SDfile   Computed 3D by Vconf -m prep SDfile
Find this compound or compounds like it in BindingDB:
Activity Spreadsheet -- Enzyme Inhibition Constant Data from BindingDB
Found 3 hits for monomerid = 50273412
TargetcAMP-specific 3',5'-cyclic phosphodiesterase 4D(Homo sapiens (Human))
Georgia State University
Curated by ChEMBL
LigandPNGBDBM50273412(3-Cyclohexyl-1-[4-methoxy-3-(tetrahydrofuran-3-ylo...)
Affinity DataIC50:  1.91E+3nM. Assay description: Inhibition of full length human PDE4D2 expressed in Escherichia coli BL21 by liquid scintillation counting
In DepthDetails ArticlePubMed
TargetPhosphodiesterase(Trypanosoma cruzi)
University Of Georgia
Curated by ChEMBL
LigandPNGBDBM50273412(3-Cyclohexyl-1-[4-methoxy-3-(tetrahydrofuran-3-ylo...)
Affinity DataIC50: >1.00E+4nM. Assay description: Inhibition of Trypanosoma cruzi Y PDEC after 30 mins
In DepthDetails ArticlePubMed
TargetcAMP-specific 3',5'-cyclic phosphodiesterase 4D(Homo sapiens (Human))
Georgia State University
Curated by ChEMBL
LigandPNGBDBM50273412(3-Cyclohexyl-1-[4-methoxy-3-(tetrahydrofuran-3-ylo...)
Affinity DataIC50:  1.91E+3nM. Assay description: Inhibition of full length human PDE4D2 expressed in Escherichia coli BL21 by liquid scintillation counting
In DepthDetails ArticlePubMed