BDBM50273488 CHEMBL464798::N-Methyl, N-phenyl-1-methyl-1H-indole-2-carboxamide
SMILES CN(C(=O)c1cc2ccccc2n1C)c1ccccc1
InChI Key InChIKey=BWRCVGRVYKKDEW-UHFFFAOYSA-N
Data  3 KI
  Tab Delimited (TSV)   2D SDfile   Computed 3D by Vconf -m prep SDfile
Find this compound or compounds like it in BindingDB:
Activity Spreadsheet -- Enzyme Inhibition Constant Data from BindingDB
Found 3 hits for monomerid = 50273488
TargetAmine oxidase [flavin-containing] A(Bos taurus)
Sapienza University Of Rome
Curated by ChEMBL
LigandPNGBDBM50273488(CHEMBL464798 | N-Methyl, N-phenyl-1-methyl-1H-indo...)
Affinity DataKi:  15nM. Assay description: Inhibition of bovine brain mitochondrial MAO-A by fluorometric assay
In DepthDetails ArticlePubMed
TargetAmine oxidase [flavin-containing] B(Bos taurus)
Sapienza University Of Rome
Curated by ChEMBL
LigandPNGBDBM50273488(CHEMBL464798 | N-Methyl, N-phenyl-1-methyl-1H-indo...)
Affinity DataKi:  21nM. Assay description: Inhibition of bovine brain mitochondrial MAO-B by fluorometric assay
In DepthDetails ArticlePubMed
TargetAmine oxidase [flavin-containing] A(Homo sapiens (Human))
Bharati Vidyapeeth Deemed University
Curated by ChEMBL
LigandPNGBDBM50273488(CHEMBL464798 | N-Methyl, N-phenyl-1-methyl-1H-indo...)
Affinity DataKi:  1.50E+7nM. Assay description: Inhibition of MAO-A receptor
In DepthDetails ArticlePubMed