BDBM50274126 CHEMBL4127938
SMILES COc1c(Br)c(OC)c(C(C)=O)c2OC(C)(C)C=Cc12
InChI Key InChIKey=UEONWFOAVQSBSL-UHFFFAOYSA-N
Data  1 IC50
  Tab Delimited (TSV)   2D SDfile   Computed 3D by Vconf -m prep SDfile
Find this compound or compounds like it in BindingDB:
Activity Spreadsheet -- Enzyme Inhibition Constant Data from BindingDB
Found 1 hit for monomerid = 50274126
TargetDNA gyrase subunit A/B(Staphylococcus aureus)
Bharathiar University
Curated by ChEMBL
LigandPNGBDBM50274126(CHEMBL4127938)
Affinity DataIC50:  1.90nM. Assay description: Inhibition of Staphylococcus aureus DNA gyrase assessed as reduction in relaxation of pBR322 DNA by SDS-PAGE analysis
In DepthDetails ArticlePubMed