BDBM50274161 CHEMBL4125765
SMILES Fc1cc(Cn2ccnc2)cc(\C=C\c2ccc(cc2)N2CCN(CC2)S(=O)(=O)C2CC2)c1
InChI Key InChIKey=ISDMRCWSPJNBMV-OWOJBTEDSA-N
Data  1 IC50
  Tab Delimited (TSV)   2D SDfile   Computed 3D by Vconf -m prep SDfile
Find this compound or compounds like it in BindingDB:
Activity Spreadsheet -- Enzyme Inhibition Constant Data from BindingDB
Found 1 hit for monomerid = 50274161
TargetSteroid 17-alpha-hydroxylase/17,20 lyase(Homo sapiens (Human))
Temple University School Of Pharmacy
Curated by ChEMBL
LigandPNGBDBM50274161(CHEMBL4125765)
Affinity DataIC50:  34nM. Assay description: Inhibition of recombinant CYP17 (unknown origin) expressed in human AD293 cells using [21-3H]17alpha-hydroxypregnenolone as substrate preincubated fo...
In DepthDetails ArticlePubMed