BDBM50274445 (+ -)-1-{3-Dodecanoyl-2,4,6-trihydroxy-5-[(2R,4S)-7-hydroxy-2-(4-hydroxy-phenyl)-chroman-4-yl]-phenyl}-dodecan-1-one::CHEMBL500796
SMILES CCCCCCCCCCCC(=O)c1c(O)c([C@H]2C[C@@H](Oc3cc(O)ccc23)c2ccc(O)cc2)c(O)c(C(=O)CCCCCCCCCCC)c1O
InChI Key InChIKey=CEJAYJCUSZHYDS-ZGAWMTGXSA-N
Data  1 IC50
  Tab Delimited (TSV)   2D SDfile   Computed 3D by Vconf -m prep SDfile
Find this compound or compounds like it in BindingDB:
Activity Spreadsheet -- Enzyme Inhibition Constant Data from BindingDB
Found 1 hit for monomerid = 50274445
TargetPhospholipase A2, membrane associated(Rattus norvegicus)
University Of Washington
Curated by ChEMBL
LigandPNGBDBM50274445((+ -)-1-{3-Dodecanoyl-2,4,6-trihydroxy-5-[(2R,4S)-...)
Affinity DataIC50:  110nM. Assay description: Inhibition of rat sPLA2 group 2A
In DepthDetails ArticlePubMed