BDBM50274591 CHEMBL505661::Thidiazuron
SMILES O=C(Nc1cnns1)Nc1ccccc1
InChI Key InChIKey=HFCYZXMHUIHAQI-UHFFFAOYSA-N
Data  1 IC50  2 EC50
PDB links: 1 PDB ID matches this monomer.
  Tab Delimited (TSV)   2D SDfile   Computed 3D by Vconf -m prep SDfile
Find this compound or compounds like it in BindingDB:
Activity Spreadsheet -- Enzyme Inhibition Constant Data from BindingDB
Found 3 hits for monomerid = 50274591
TargetHistidine kinase 4(Arabidopsis thaliana)
Ieb As Cr & Palacký
Curated by ChEMBL
LigandPNGBDBM50274591(CHEMBL505661 | Thidiazuron)
Affinity DataEC50:  1.00E+3nM. Assay description: Activation of Arabidopsis thaliana AHK4/CRE1 receptor expressed in Escherichia coli KMI001 by beta-galactosidase activity
TargetCytokinin dehydrogenase 2(Arabidopsis thaliana)
Ieb As Cr & Palacký
Curated by ChEMBL
LigandPNGBDBM50274591(CHEMBL505661 | Thidiazuron)
Affinity DataIC50:  2.90E+4nM. Assay description: Inhibition of sArabidopsis thaliana CKX2 expressed in Saccharomyces cerevisiae 23344c ura-
In DepthDetails ArticlePubMed
TargetHistidine kinase 3(Arabidopsis thaliana)
Ieb As Cr & Palacký
Curated by ChEMBL
LigandPNGBDBM50274591(CHEMBL505661 | Thidiazuron)
Affinity DataEC50:  950nM. Assay description: Activation of Arabidopsis thaliana AHK3 receptor expressed in Escherichia coli KMI001 by beta-galactosidase activity
In DepthDetails ArticlePubMed