BDBM50274741 CHEMBL4126470
SMILES C[C@@H](NC(=O)[C@@H](N)Cc1c(C)cc(O)cc1C)C(=O)N[C@@H](Cc1ccccc1-c1ccccc1)C(=O)NCC(N)=O
InChI Key InChIKey=QFBGVCWOFLNHNT-PHXCCWLDSA-N
Data  4 IC50  2 EC50
  Tab Delimited (TSV)   2D SDfile   Computed 3D by Vconf -m prep SDfile
Find this compound or compounds like it in BindingDB:
Activity Spreadsheet -- Enzyme Inhibition Constant Data from BindingDB
Found 6 hits for monomerid = 50274741
TargetDelta-type opioid receptor(MOUSE)
Vrije Universiteit Brussel
Curated by ChEMBL
LigandPNGBDBM50274741(CHEMBL4126470)
Affinity DataIC50:  20nM. Assay description: Displacement of [125I]-Deltorphin 2 from mouse Flag-tagged delta-opioid receptor expressed in HEK293 cell membranes after 60 mins by gamma counting
In DepthDetails ArticlePubMed
TargetMu-type opioid receptor(MOUSE)
Vrije Universiteit Brussel
Curated by ChEMBL
LigandPNGBDBM50274741(CHEMBL4126470)
Affinity DataIC50:  0.350nM. Assay description: Displacement of [125I]-DAMGO from mouse Flag-tagged mu-opioid receptor expressed in HEK293 cell membranes after 60 mins by gamma counting
In DepthDetails ArticlePubMed
TargetDelta-type opioid receptor(MOUSE)
Vrije Universiteit Brussel
Curated by ChEMBL
LigandPNGBDBM50274741(CHEMBL4126470)
Affinity DataIC50:  2.60nM. Assay description: Tested for thromboxane antagonist potency (pA2) against U 44619 induced platelet aggregation using human platelet rich plasma
In DepthDetails ArticlePubMed
TargetMu-type opioid receptor(Rattus norvegicus (rat))
Vrije Universiteit Brussel
Curated by ChEMBL
LigandPNGBDBM50274741(CHEMBL4126470)
Affinity DataEC50:  0.120nM. Assay description: Tested for thromboxane antagonist potency (pA2) against U 44619 induced platelet aggregation using human platelet rich plasma
In DepthDetails ArticlePubMed
TargetDelta-type opioid receptor(Rattus norvegicus (rat))
Vrije Universiteit Brussel
Curated by ChEMBL
LigandPNGBDBM50274741(CHEMBL4126470)
Affinity DataEC50:  4.90nM. Assay description: Tested for thromboxane antagonist potency (pA2) against U 44619 induced platelet aggregation using human platelet rich plasma
In DepthDetails ArticlePubMed
TargetMu-type opioid receptor(GUINEA PIG)
Vrije Universiteit Brussel
Curated by ChEMBL
LigandPNGBDBM50274741(CHEMBL4126470)
Affinity DataIC50:  1.60nM. Assay description: Compound was tested for competitive blocking of guinea pig ileal smooth muscle strip contraction to cholecystokinin-8 (CCK-8) receptor
In DepthDetails ArticlePubMed