BDBM50274838 CHEMBL456437::trans-4-(4-Phenylcyclohexyl)-1-(2-pyridinyl)piperazine
SMILES C1C[C@@H](CC[C@H]1N1CCN(CC1)c1ccccn1)c1ccccc1
InChI Key InChIKey=FSAWWDNTYVTGLO-MXVIHJGJSA-N
Data  2 KI
  Tab Delimited (TSV)   2D SDfile   Computed 3D by Vconf -m prep SDfile
Find this compound or compounds like it in BindingDB:
Activity Spreadsheet -- Enzyme Inhibition Constant Data from BindingDB
Found 2 hits for monomerid = 50274838
Target3-beta-hydroxysteroid-Delta(8),Delta(7)-isomerase(Cavia porcellus)
Universita Degli Studi Di Bari
Curated by ChEMBL
LigandPNGBDBM50274838(CHEMBL456437 | trans-4-(4-Phenylcyclohexyl)-1-(2-p...)
Affinity DataKi:  17nM. Assay description: Displacement of [3H](-)-(S)-emopamil from EBP in guinea pig liver membrane
In DepthDetails ArticlePubMed
TargetSigma non-opioid intracellular receptor 1(Cavia porcellus (Guinea pig))
Universita Degli Studi Di Bari
Curated by ChEMBL
LigandPNGBDBM50274838(CHEMBL456437 | trans-4-(4-Phenylcyclohexyl)-1-(2-p...)
Affinity DataKi:  104nM. Assay description: Displacement of [3H](+)-pentazocine from sigma 1 receptor in guinea pig brain membrane without cerebellum
In DepthDetails ArticlePubMed