BDBM50274876 CHEMBL457508::trans-4-[4-(2-Methylphenyl)cyclohexyl]-1-(2-pyridinyl)piperazine
SMILES Cc1ccccc1[C@H]1CC[C@@H](CC1)N1CCN(CC1)c1ccccn1
InChI Key InChIKey=ISKQMAXCHQFYHK-MXVIHJGJSA-N
Data  2 KI
  Tab Delimited (TSV)   2D SDfile   Computed 3D by Vconf -m prep SDfile
Find this compound or compounds like it in BindingDB:
Activity Spreadsheet -- Enzyme Inhibition Constant Data from BindingDB
Found 2 hits for monomerid = 50274876
Target3-beta-hydroxysteroid-Delta(8),Delta(7)-isomerase(Cavia porcellus)
Universita Degli Studi Di Bari
Curated by ChEMBL
LigandPNGBDBM50274876(CHEMBL457508 | trans-4-[4-(2-Methylphenyl)cyclohex...)
Affinity DataKi:  9nM. Assay description: Displacement of [3H](-)-(S)-emopamil from EBP in guinea pig liver membrane
In DepthDetails ArticlePubMed
TargetSigma non-opioid intracellular receptor 1(Cavia porcellus (Guinea pig))
Universita Degli Studi Di Bari
Curated by ChEMBL
LigandPNGBDBM50274876(CHEMBL457508 | trans-4-[4-(2-Methylphenyl)cyclohex...)
Affinity DataKi:  31nM. Assay description: Displacement of [3H](+)-pentazocine from sigma 1 receptor in guinea pig brain membrane without cerebellum
In DepthDetails ArticlePubMed