BDBM50274890 (Z)-3-Amino-5-(4'-hydroxy-3',5-diiodobenzylidene)-2-thioxo-thiazolidin-4-one::CHEMBL511165
SMILES NN1C(=S)S\C(=C/c2cc(I)c(O)c(I)c2)C1=O
InChI Key InChIKey=QXSWMUBYZNMABY-CLTKARDFSA-N
Data  1 IC50
  Tab Delimited (TSV)   2D SDfile   Computed 3D by Vconf -m prep SDfile
Find this compound or compounds like it in BindingDB:
Activity Spreadsheet -- Enzyme Inhibition Constant Data from BindingDB
Found 1 hit for monomerid = 50274890
TargetArylamine N-acetyltransferase 1(Homo sapiens (Human))
University Of Oxford
Curated by ChEMBL
LigandPNGBDBM50274890((Z)-3-Amino-5-(4'-hydroxy-3',5-diiodobenzylidene)-...)
Affinity DataIC50:  1.10E+3nM. Assay description: Inhibition of human recombinant NAT1 assessed as hydrolysis of acetyl coA using PABA as substrate by Ellman's method
In DepthDetails ArticlePubMed