BDBM50275051 (1H-Benzoimidazol-2-yl)-(5-chloro-1,2,3,4-tetrahydronaphthalen-1-yl)amine::CHEMBL457743
SMILES Clc1cccc2C(CCCc12)Nc1nc2ccccc2[nH]1
InChI Key InChIKey=JXQZLHYWQBGVOS-UHFFFAOYSA-N
Data  1 Kd
  Tab Delimited (TSV)   2D SDfile   Computed 3D by Vconf -m prep SDfile
Find this compound or compounds like it in BindingDB:
Activity Spreadsheet -- Enzyme Inhibition Constant Data from BindingDB
Found 1 hit for monomerid = 50275051
TargetSmall conductance calcium-activated potassium channel protein 3(Rattus norvegicus)
Neurosearch
Curated by ChEMBL
LigandPNGBDBM50275051((1H-Benzoimidazol-2-yl)-(5-chloro-1,2,3,4-tetrahyd...)
Affinity DataKd:  44nM. Assay description: Inhibition of Wistar rat recombinant SK3 channel expressed in HEK293 cells by whole cell patch clamp technique
In DepthDetails ArticlePubMed