BDBM50275063 (Z)-3-Methyl-5-(3'-methylbenzylidene)-2-thioxothiazolidin-4-one::CHEMBL444910
SMILES CN1C(=S)S\C(=C/c2cccc(C)c2)C1=O
InChI Key InChIKey=JGWDVGVIKVARIF-YFHOEESVSA-N
Data  1 IC50
  Tab Delimited (TSV)   2D SDfile   Computed 3D by Vconf -m prep SDfile
Find this compound or compounds like it in BindingDB:
Activity Spreadsheet -- Enzyme Inhibition Constant Data from BindingDB
Found 1 hit for monomerid = 50275063
TargetArylamine N-acetyltransferase 2(Mus musculus)
University Of Oxford
Curated by ChEMBL
LigandPNGBDBM50275063((Z)-3-Methyl-5-(3'-methylbenzylidene)-2-thioxothia...)
Affinity DataIC50:  3.00E+4nM. Assay description: Inhibition of mouse recombinant NAT2 assessed as hydrolysis of acetyl coA using PABA as substrate by Ellman's method
In DepthDetails ArticlePubMed