BDBM50275131 2-(1H-Benzoimidazol-2-yl)-1,2,3,4-tetrahydroisoquinoline::CHEMBL539935
SMILES C1Cc2ccccc2CN1c1nc2ccccc2[nH]1
InChI Key InChIKey=IZMMNYOCEHWHMF-UHFFFAOYSA-N
Data  1 Kd
  Tab Delimited (TSV)   2D SDfile   Computed 3D by Vconf -m prep SDfile
Find this compound or compounds like it in BindingDB:
Activity Spreadsheet -- Enzyme Inhibition Constant Data from BindingDB
Found 1 hit for monomerid = 50275131
TargetSmall conductance calcium-activated potassium channel protein 3(Rattus norvegicus)
Neurosearch
Curated by ChEMBL
LigandPNGBDBM50275131(2-(1H-Benzoimidazol-2-yl)-1,2,3,4-tetrahydroisoqui...)
Affinity DataKd:  1.40E+4nM. Assay description: Inhibition of Wistar rat recombinant SK3 channel expressed in HEK293 cells by whole cell patch clamp technique
In DepthDetails ArticlePubMed