BDBM50275484 CHEMBL4128388
SMILES Cn1cc(cn1)-c1ccc(cc1)C(=O)N([C@@H]1CCCNC1)c1nccc2ccccc12
InChI Key InChIKey=ZHDZEUMVTTWVJV-JOCHJYFZSA-N
Data  1 KI
  Tab Delimited (TSV)   2D SDfile   Computed 3D by Vconf -m prep SDfile
Find this compound or compounds like it in BindingDB:
Activity Spreadsheet -- Enzyme Inhibition Constant Data from BindingDB
Found 1 hit for monomerid = 50275484
TargetPotassium voltage-gated channel subfamily H member 2(Homo sapiens (Human))
Pfizer
Curated by ChEMBL
LigandPNGBDBM50275484(CHEMBL4128388)
Affinity DataKi:  1.60E+4nM. Assay description: Inhibition of dofetilide binding to human ERG by fluorescence polarization assay
In DepthDetails ArticlePubMed