BDBM50275660 CHEMBL488797::N-(2-(3,5-dimethyl-1H-pyrazol-1-yl)-6-(2-methoxyphenyl)pyrimidin-4-yl)acetamide
SMILES COc1ccccc1-c1cc(NC(C)=O)nc(n1)-n1nc(C)cc1C
InChI Key InChIKey=IHZJCEYKGHNJAV-UHFFFAOYSA-N
Data  1 KI
  Tab Delimited (TSV)   2D SDfile   Computed 3D by Vconf -m prep SDfile
Find this compound or compounds like it in BindingDB:
Activity Spreadsheet -- Enzyme Inhibition Constant Data from BindingDB
Found 1 hit for monomerid = 50275660
TargetAdenosine receptor A2a(Homo sapiens (Human))
Neurocrine Biosciences
Curated by ChEMBL
LigandPNGBDBM50275660(CHEMBL488797 | N-(2-(3,5-dimethyl-1H-pyrazol-1-yl)...)
Affinity DataKi:  2nM. Assay description: Displacement of [3H]ZM241385 from human adenosine A2A receptor expressed in HEK293 cells
In DepthDetails ArticlePubMed