BDBM50276397 4-((S)-2-acetamido-3-((S)-5-amino-1-((2-((S)-1-amino-4-methyl-1-oxopentan-2-ylamino)-2-oxoethyl)(pent-4-enyl)amino)-1,5-dioxopentan-2-ylamino)-3-oxopropyl)phenyl dihydrogen phosphate::CHEMBL454525
SMILES CC(C)C[C@H](NC(=O)CN(CCCC=C)C(=O)[C@H](CCC(N)=O)NC(=O)[C@H](Cc1ccc(OP(O)(O)=O)cc1)NC(C)=O)C(N)=O
InChI Key InChIKey=GUCMOEGXTGEAGI-HJOGWXRNSA-N
Data  1 IC50
  Tab Delimited (TSV)   2D SDfile   Computed 3D by Vconf -m prep SDfile
Find this compound or compounds like it in BindingDB:
Activity Spreadsheet -- Enzyme Inhibition Constant Data from BindingDB
Found 1 hit for monomerid = 50276397
TargetSHC-transforming protein 1(Homo sapiens (Human))
National Cancer Institute-Frederick
Curated by ChEMBL
LigandPNGBDBM50276397(4-((S)-2-acetamido-3-((S)-5-amino-1-((2-((S)-1-ami...)
Affinity DataIC50:  1.60E+4nM. Assay description: Displacement of FITC-tagged NH-(CH2)4-CO-phospho-tyrosine-glutamine-glycine-leucine-serine-amide from Shc Src homology 2 domain (unknown origin) by f...
In DepthDetails ArticlePubMed