BDBM50276414 (S)-4,4-difluoro-N-(3-(4-(3-isopropyl-5-methyl-4H-1,2,4-triazol-4-yl)piperidin-1-yl)-1-phenylpropyl)cyclohexanecarboxamide::CHEMBL459571
SMILES CC(C)c1nnc(C)n1C1CCN(CC[C@H](NC(=O)C2CCC(F)(F)CC2)c2ccccc2)CC1
InChI Key InChIKey=SFVYQDVYAMTRIX-DEOSSOPVSA-N
Data  1 IC50
  Tab Delimited (TSV)   2D SDfile   Computed 3D by Vconf -m prep SDfile
Find this compound or compounds like it in BindingDB:
Activity Spreadsheet -- Enzyme Inhibition Constant Data from BindingDB
Found 1 hit for monomerid = 50276414
TargetC-C chemokine receptor type 5(Homo sapiens (Human))
Pfizer
Curated by ChEMBL
LigandPNGBDBM50276414((S)-4,4-difluoro-N-(3-(4-(3-isopropyl-5-methyl-4H-...)
Affinity DataIC50:  7.5nM. Assay description: Antagonist activity at human recombinant CCR5 expressed in human HeLa-P4 cells assessed as inhibition of human HeLa-P4 cells binding to HIV1 gp160 ex...
In DepthDetails ArticlePubMed