BDBM50276519 (2R,4R)-1-((S)-2-amino-3,3-bis(4-fluorophenyl)propanoyl)-4-fluoropyrrolidine-2-carbonitrile::CHEMBL456413
SMILES N[C@@H](C(c1ccc(F)cc1)c1ccc(F)cc1)C(=O)N1C[C@H](F)C[C@@H]1C#N
InChI Key InChIKey=URRAHSMDPCMOTH-LMMKCTJWSA-N
Data  1 IC50
  Tab Delimited (TSV)   2D SDfile   Computed 3D by Vconf -m prep SDfile
Find this compound or compounds like it in BindingDB:
Activity Spreadsheet -- Enzyme Inhibition Constant Data from BindingDB
Found 1 hit for monomerid = 50276519
TargetDipeptidyl peptidase 4(Homo sapiens (Human))
Matrix Laboratories
Curated by ChEMBL
LigandPNGBDBM50276519((2R,4R)-1-((S)-2-amino-3,3-bis(4-fluorophenyl)prop...)
Affinity DataIC50:  22nM. Assay description: Inhibition of DPP4
In DepthDetails ArticlePubMed