BDBM50277027 2-[1-(1,1-Dioxo-1lambda*6*-thiomorpholine-4-carbonyl)-pentylsulfanyl]-3-phenyl-3H-quinazolin-4-one::CHEMBL460422
SMILES CCCCC(Sc1nc2ccccc2c(=O)n1-c1ccccc1)C(=O)N1CCS(=O)(=O)CC1
InChI Key InChIKey=PJGVUHJHLMESCZ-UHFFFAOYSA-N
Data  1 IC50
  Tab Delimited (TSV)   2D SDfile   Computed 3D by Vconf -m prep SDfile
Find this compound or compounds like it in BindingDB:
Activity Spreadsheet -- Enzyme Inhibition Constant Data from BindingDB
Found 1 hit for monomerid = 50277027
TargetSerine/threonine-protein kinase Chk1(Homo sapiens (Human))
Merck Research Laboratories
Curated by ChEMBL
LigandPNGBDBM50277027(2-[1-(1,1-Dioxo-1lambda*6*-thiomorpholine-4-carbon...)
Affinity DataIC50:  6.00E+3nM. Assay description: Inhibition of C-terminal 6-His tagged human Chk1 by HTRF assay in presence of 0.1 mM ATP
In DepthDetails ArticlePubMed