BDBM50277109 CHEMBL4174426
SMILES CC(C)c1oc2cccc(CC3CCCCC3)c2c(=O)c1OCCCO
InChI Key InChIKey=INAFFPWIWGRCPI-UHFFFAOYSA-N
Data  1 IC50
  Tab Delimited (TSV)   2D SDfile   Computed 3D by Vconf -m prep SDfile
Find this compound or compounds like it in BindingDB:
Activity Spreadsheet -- Enzyme Inhibition Constant Data from BindingDB
Found 1 hit for monomerid = 50277109
TargetInterleukin-5(Mus musculus)
Chungnam National University
Curated by ChEMBL
LigandPNGBDBM50277109(CHEMBL4174426)
Affinity DataIC50:  5.50E+3nM. Assay description: Inhibition of mouse IL-5-induced cell proliferation in mouse Y16 cells after 48 hrs by WST-1 assay relative to control
In DepthDetails ArticlePubMed