BDBM50277215 CHEMBL515285::N1-(2-aminophenyl)-N8-(biphenyl-3-yl)octanediamide
SMILES Nc1ccccc1NC(=O)CCCCCCC(=O)Nc1cccc(c1)-c1ccccc1
InChI Key InChIKey=YIDXRJJVZRCQTD-UHFFFAOYSA-N
Data  2 IC50
  Tab Delimited (TSV)   2D SDfile   Computed 3D by Vconf -m prep SDfile
Find this compound or compounds like it in BindingDB:
Activity Spreadsheet -- Enzyme Inhibition Constant Data from BindingDB
Found 2 hits for monomerid = 50277215
TargetHistone deacetylase 6(Homo sapiens (Human))
Methylgene
Curated by ChEMBL
LigandPNGBDBM50277215(CHEMBL515285 | N1-(2-aminophenyl)-N8-(biphenyl-3-y...)
Affinity DataIC50:  5.00E+4nM. Assay description: Inhibition of human recombinant N-terminal histidine-tagged HDAC6 expressed in baculovirus by fluorimetry
In DepthDetails ArticlePubMed
TargetHistone deacetylase 1(Homo sapiens (Human))
Methylgene
Curated by ChEMBL
LigandPNGBDBM50277215(CHEMBL515285 | N1-(2-aminophenyl)-N8-(biphenyl-3-y...)
Affinity DataIC50:  490nM. Assay description: Inhibition of human recombinant C-terminal FLAG-tagged HDAC1 expressed in baculovirus by fluorimetry
In DepthDetails ArticlePubMed