BDBM50277468 CHEMBL475305::[5-(6-Amino-9-naphthalen-2-ylmethyl-9H-purin-8-yl)-furan-2-yl]-phosphonic Acid
SMILES Nc1ncnc2n(Cc3ccc4ccccc4c3)c(nc12)-c1ccc(o1)P(O)(O)=O
InChI Key InChIKey=WYJIQXFNDWNRSW-UHFFFAOYSA-N
Data  1 IC50
  Tab Delimited (TSV)   2D SDfile   Computed 3D by Vconf -m prep SDfile
Find this compound or compounds like it in BindingDB:
Activity Spreadsheet -- Enzyme Inhibition Constant Data from BindingDB
Found 1 hit for monomerid = 50277468
TargetFructose-1,6-bisphosphatase 1(Homo sapiens (Human))
Metabasis Therapeutics
Curated by ChEMBL
LigandPNGBDBM50277468(CHEMBL475305 | [5-(6-Amino-9-naphthalen-2-ylmethyl...)
Affinity DataIC50:  3.30E+3nM. Assay description: Inhibition of human liver FBPase expressed in Escherichia coli by spectrophotometry
In DepthDetails ArticlePubMed