BDBM50277609 CHEMBL507312::[5-(6-Amino-9-isobutyl-2-methylsulfanyl-9H-purin-8-yl)-furan-2-yl]-phosphonic Acid
SMILES CSc1nc(N)c2nc(-c3ccc(o3)P(O)(O)=O)n(CC(C)C)c2n1
InChI Key InChIKey=WWOOHDHSIRZASU-UHFFFAOYSA-N
Data  2 IC50
  Tab Delimited (TSV)   2D SDfile   Computed 3D by Vconf -m prep SDfile
Find this compound or compounds like it in BindingDB:
Activity Spreadsheet -- Enzyme Inhibition Constant Data from BindingDB
Found 2 hits for monomerid = 50277609
TargetFructose-1,6-bisphosphatase 1(Rattus norvegicus)
Metabasis Therapeutics
Curated by ChEMBL
LigandPNGBDBM50277609(CHEMBL507312 | [5-(6-Amino-9-isobutyl-2-methylsulf...)
Affinity DataIC50: >2.00E+4nM. Assay description: Inhibition of rat liver FBPase
In DepthDetails ArticlePubMed
TargetFructose-1,6-bisphosphatase 1(Homo sapiens (Human))
Metabasis Therapeutics
Curated by ChEMBL
LigandPNGBDBM50277609(CHEMBL507312 | [5-(6-Amino-9-isobutyl-2-methylsulf...)
Affinity DataIC50:  700nM. Assay description: Inhibition of human liver FBPase expressed in Escherichia coli by spectrophotometry
In DepthDetails ArticlePubMed