BDBM50278302 2-(5-morpholino-2H-tetrazol-2-yl)-N'-((5-(3-nitrophenyl)furan-2-yl)methylene)acetohydrazide::CHEMBL470182
SMILES [O-][N+](=O)c1cccc(c1)-c1ccc(C=NNC(=O)Cn2nnc(n2)N2CCOCC2)o1
InChI Key InChIKey=WSRADJCXYWWXBM-UHFFFAOYSA-N
Data  1 IC50
  Tab Delimited (TSV)   2D SDfile   Computed 3D by Vconf -m prep SDfile
Find this compound or compounds like it in BindingDB:
Activity Spreadsheet -- Enzyme Inhibition Constant Data from BindingDB
Found 1 hit for monomerid = 50278302
TargetNH(3)-dependent NAD(+) synthetase(Bacillus anthracis)
University Of Alabama At Birmingham
Curated by ChEMBL
LigandPNGBDBM50278302(2-(5-morpholino-2H-tetrazol-2-yl)-N'-((5-(3-nitrop...)
Affinity DataIC50:  1.09E+5nM. Assay description: Inhibition of Bacillus anthracis NAD synthetase
In DepthDetails ArticlePubMed