BDBM50278370 CHEMBL471236::N-(3-(1,3-dioxo-2-phenylisoindolin-5-yloxy)phenyl)-3-nitrobenzamide
SMILES [O-][N+](=O)c1cccc(c1)C(=O)Nc1cccc(Oc2ccc3C(=O)N(C(=O)c3c2)c2ccccc2)c1
InChI Key InChIKey=PJWQIKBJHDREAF-UHFFFAOYSA-N
Data  1 IC50
  Tab Delimited (TSV)   2D SDfile   Computed 3D by Vconf -m prep SDfile
Find this compound or compounds like it in BindingDB:
Activity Spreadsheet -- Enzyme Inhibition Constant Data from BindingDB
Found 1 hit for monomerid = 50278370
TargetNH(3)-dependent NAD(+) synthetase(Bacillus anthracis)
University Of Alabama At Birmingham
Curated by ChEMBL
LigandPNGBDBM50278370(CHEMBL471236 | N-(3-(1,3-dioxo-2-phenylisoindolin-...)
Affinity DataIC50:  2.02E+5nM. Assay description: Inhibition of Bacillus anthracis NAD synthetase
In DepthDetails ArticlePubMed