BDBM50278607 4-(7-(3-chloro-4-fluorophenylamino)thiazolo[4,5-d]pyrimidin-2-ylamino)-N,N-bis(2-methoxyethyl)benzenesulfonamide::CHEMBL470010
SMILES COCCN(CCOC)S(=O)(=O)c1ccc(Nc2nc3ncnc(Nc4ccc(F)c(Cl)c4)c3s2)cc1
InChI Key InChIKey=AMIDDZHJRZVVOK-UHFFFAOYSA-N
Data  1 IC50
  Tab Delimited (TSV)   2D SDfile   Computed 3D by Vconf -m prep SDfile
Find this compound or compounds like it in BindingDB:
Activity Spreadsheet -- Enzyme Inhibition Constant Data from BindingDB
Found 1 hit for monomerid = 50278607
TargetEpidermal growth factor receptor(Homo sapiens (Human))
Johnson & Johnson Pharmaceutical Research & Development
Curated by ChEMBL
LigandPNGBDBM50278607(4-(7-(3-chloro-4-fluorophenylamino)thiazolo[4,5-d]...)
Affinity DataIC50:  25nM. Assay description: Inhibition of EGFR (unknown origin)
In DepthDetails ArticlePubMed