BDBM50278990 CHEMBL4164524
SMILES Clc1cc(NC(=O)OCCCCCNCc2ccccc2)cc(Cl)n1
InChI Key InChIKey=KCHQKPAJDQOEDE-UHFFFAOYSA-N
Data  1 KI  2 IC50
  Tab Delimited (TSV)   2D SDfile   Computed 3D by Vconf -m prep SDfile
Find this compound or compounds like it in BindingDB:
Activity Spreadsheet -- Enzyme Inhibition Constant Data from BindingDB
Found 3 hits for monomerid = 50278990
TargetAcetylcholinesterase(Electrophorus electricus (Electric eel))
Sapienza University Of Rome
Curated by ChEMBL
LigandPNGBDBM50278990(CHEMBL4164524)
Affinity DataKi:  39nM. Assay description: Mixed inhibition of electric eel AChE using acetylthiocholine iodide as substrate measured from 0.5 to 1.5 mins by Dixon plot analysis
In DepthDetails ArticlePubMed
TargetCholinesterase(Homo sapiens (Human))
Sapienza University Of Rome
Curated by ChEMBL
LigandPNGBDBM50278990(CHEMBL4164524)
Affinity DataIC50:  4.59E+3nM. Assay description: Inhibition of human serum BChE using butyrylthiocholine iodide as substrate preincubated for 20 mins followed by substrate addition measured for 3 mi...
In DepthDetails ArticlePubMed
TargetAcetylcholinesterase(Homo sapiens (Human))
Sapienza University Of Rome
Curated by ChEMBL
LigandPNGBDBM50278990(CHEMBL4164524)
Affinity DataIC50:  153nM. Assay description: Inhibition of human serum AChE using acetylthiocholine iodide as substrate preincubated for 20 mins followed by substrate addition measured for 3 min...
In DepthDetails ArticlePubMed