BDBM50279122 (Z)-2-oxo-3-[Phenyl-(4-piperidin-1-ylmethyl-phenylamino)-methylene]-2,3-dihydro-1H-indole-6-carboxylic Acid::CHEMBL500436
SMILES OC(=O)c1ccc2C(C(=Nc3ccc(CN4CCCCC4)cc3)c3ccccc3)C(=O)Nc2c1
InChI Key InChIKey=TUTWEBBAPHBNAL-UHFFFAOYSA-N
Data  1 IC50
  Tab Delimited (TSV)   2D SDfile   Computed 3D by Vconf -m prep SDfile
Find this compound or compounds like it in BindingDB:
Activity Spreadsheet -- Enzyme Inhibition Constant Data from BindingDB
Found 1 hit for monomerid = 50279122
TargetVascular endothelial growth factor receptor 2(Human)
Boehringer Ingelheim Pharma
Curated by ChEMBL
LigandPNGBDBM50279122((Z)-2-oxo-3-[Phenyl-(4-piperidin-1-ylmethyl-phenyl...)
Affinity DataIC50: >1.00E+3nM. Assay description: Inhibition of human VEGFR2 expressed in Sf9 cells
In DepthDetails ArticlePubMed