BDBM50279575 CHEMBL4163180
SMILES Cc1cc2n(cc(-c3cccc(N)c3C)c2cc1C#N)[C@@H]1C[C@H](O)C1
InChI Key InChIKey=SUVBFRRRQUCYKU-IYBDPMFKSA-N
Data  1 IC50
  Tab Delimited (TSV)   2D SDfile   Computed 3D by Vconf -m prep SDfile
Find this compound or compounds like it in BindingDB:
Activity Spreadsheet -- Enzyme Inhibition Constant Data from BindingDB
Found 1 hit for monomerid = 50279575
TargetLysine-specific histone demethylase 1A(Homo sapiens (Human))
Therachem Research Medilab (India)
Curated by ChEMBL
LigandPNGBDBM50279575(CHEMBL4163180)
Affinity DataIC50:  4nM. Assay description: Inhibition of full length LSD1 (unknown origin) using H3K4me1 as substrate incubated for 30 mins followed by substrate addition measured after 60 min...
In DepthDetails ArticlePubMed