BDBM50280195 1-(2-Chloro-phenyl)-tetrahydro-pyridazin-3-one::CHEMBL27410
SMILES Clc1ccccc1N1CCCC(=O)N1
InChI Key InChIKey=USBDJQWXUWOUBR-UHFFFAOYSA-N
Data  1 IC50
  Tab Delimited (TSV)   2D SDfile   Computed 3D by Vconf -m prep SDfile
Find this compound or compounds like it in BindingDB:
Activity Spreadsheet -- Enzyme Inhibition Constant Data from BindingDB
Found 1 hit for monomerid = 50280195
TargetPolyunsaturated fatty acid 5-lipoxygenase(Homo sapiens (Human))
TBA
Curated by ChEMBL
LigandPNGBDBM50280195(1-(2-Chloro-phenyl)-tetrahydro-pyridazin-3-one | C...)
Affinity DataIC50:  9.90E+4nM. Assay description: Inhibitory activity against 5-lipoxygenase.
In DepthDetails Article