BDBM50280646 2-[1-(1-Benzyl-piperidin-4-yl)-meth-(E)-ylidene]-5,6-dimethoxy-indan-1-one::CHEMBL168938
SMILES COc1cc2C\C(=C/C3CCN(Cc4ccccc4)CC3)C(=O)c2cc1OC
InChI Key InChIKey=LPMOTUSFDTTWJL-UDWIEESQSA-N
Data  2 KI  6 IC50
PDB links: 1 PDB ID matches this monomer.
  Tab Delimited (TSV)   2D SDfile   Computed 3D by Vconf -m prep SDfile
Find this compound or compounds like it in BindingDB:
Activity Spreadsheet -- Enzyme Inhibition Constant Data from BindingDB
Found 8 hits for monomerid = 50280646
TargetAcetylcholinesterase(Homo sapiens (Human))
Universit£
Curated by ChEMBL
LigandPNGBDBM50280646(2-[1-(1-Benzyl-piperidin-4-yl)-meth-(E)-ylidene]-5...)
Affinity DataKi:  35nM. Assay description: Non-competitive inhibition of human erythrocytes AchE using acetylthiocholine iodide as substrate incubated for 20 mins by Lineweaver-Burk plot analy...
In DepthDetails ArticlePubMed
TargetCholinesterase(Equus caballus (Horse))
Universit£
Curated by ChEMBL
LigandPNGBDBM50280646(2-[1-(1-Benzyl-piperidin-4-yl)-meth-(E)-ylidene]-5...)
Affinity DataKi:  2.44E+3nM. Assay description: Mixed inhibition of horse serum BuChE using butyrylthiocoline iodide as substrate incubated for 20 mins by Lineweaver-Burk plot analysis
In DepthDetails ArticlePubMed
TargetAcetylcholinesterase(Homo sapiens (Human))
Universit£
Curated by ChEMBL
LigandPNGBDBM50280646(2-[1-(1-Benzyl-piperidin-4-yl)-meth-(E)-ylidene]-5...)
Affinity DataIC50:  58nM. Assay description: Inhibition of human erythrocytes AchE using acetylthiocholine iodide as substrate incubated for 20 mins by Ellman method
In DepthDetails ArticlePubMed
TargetBeta-secretase 1(Homo sapiens (Human))
China Pharmaceutical University
Curated by ChEMBL
LigandPNGBDBM50280646(2-[1-(1-Benzyl-piperidin-4-yl)-meth-(E)-ylidene]-5...)
Affinity DataIC50:  697nM. Assay description: Inhibition of BACE-1 (unknown origin)
In DepthDetails ArticlePubMed
TargetAcetylcholinesterase(Electrophorus electricus (Electric eel))
University Of Pretoria
Curated by ChEMBL
LigandPNGBDBM50280646(2-[1-(1-Benzyl-piperidin-4-yl)-meth-(E)-ylidene]-5...)
Affinity DataIC50:  420nM. Assay description: Inhibition of electric eel AChE using acetylthiocholine iodide as substrate by Ellman's method
In DepthDetails ArticlePubMed
TargetBeta-secretase 1(Mus musculus (Mouse))
Universit£
Curated by ChEMBL
LigandPNGBDBM50280646(2-[1-(1-Benzyl-piperidin-4-yl)-meth-(E)-ylidene]-5...)
Affinity DataIC50: <1.00E+3nM. Assay description: Inhibition of mouse BACE-1 preincubated for 10 mins followed by fluorescent peptide substrate addition measured for 30 mins by fluorescence plate rea...
In DepthDetails ArticlePubMed
TargetAcetylcholinesterase(Mus musculus (mouse))
TBA
Curated by ChEMBL
LigandPNGBDBM50280646(2-[1-(1-Benzyl-piperidin-4-yl)-meth-(E)-ylidene]-5...)
Affinity DataIC50:  13nM. Assay description: Inhibition of Acetylcholinesterase activity in mouse brain homogenate
In DepthDetails Article
TargetCholinesterase(Equus caballus (Horse))
Universit£
Curated by ChEMBL
LigandPNGBDBM50280646(2-[1-(1-Benzyl-piperidin-4-yl)-meth-(E)-ylidene]-5...)
Affinity DataIC50:  4.74E+3nM. Assay description: Inhibition of horse serum BuChE using butyrylthiocoline iodide as substrate incubated for 20 mins by Ellman method
In DepthDetails ArticlePubMed