BDBM50280714 (S)-2-{(S)-1-{3-[(E)-2-(7-Chloro-quinolin-2-yl)-vinyl]-phenyl}-3-[2-(1-hydroxy-1-methyl-ethyl)-phenyl]-propylsulfanylmethyl}-pentanoic acid::CHEMBL15161::L-695499
SMILES CCC[C@H](CS[C@@H](CCc1ccccc1C(C)(C)O)c1cccc(\C=C\c2ccc3ccc(Cl)cc3n2)c1)C(O)=O
InChI Key InChIKey=JFVHVNKZLUZFFI-YHFVJFFQSA-N
Data  1 IC50
  Tab Delimited (TSV)   2D SDfile   Computed 3D by Vconf -m prep SDfile
Find this compound or compounds like it in BindingDB:
Activity Spreadsheet -- Enzyme Inhibition Constant Data from BindingDB
Found 1 hit for monomerid = 50280714
TargetCysteinyl leukotriene receptor 1(GUINEA PIG)
TBA
Curated by ChEMBL
LigandPNGBDBM50280714((S)-2-{(S)-1-{3-[(E)-2-(7-Chloro-quinolin-2-yl)-vi...)
Affinity DataIC50:  0.900nM. Assay description: Inhibitory concentration against [3H]-Leukotriene D4 binding to guinea-pig lung membranes was determined
In DepthDetails Article