BDBM50280836 CHEMBL56834::Phosphoric acid mono-((1S,2R,3R)-2-hydroxy-3-hydroxymethyl-cyclopentyl) ester
SMILES OC[C@H]1CC[C@H](OP(O)(O)=O)[C@@H]1O
InChI Key InChIKey=JXOISXROZPORMM-NGJCXOISSA-N
Data  1 IC50
  Tab Delimited (TSV)   2D SDfile   Computed 3D by Vconf -m prep SDfile
Find this compound or compounds like it in BindingDB:
Activity Spreadsheet -- Enzyme Inhibition Constant Data from BindingDB
Found 1 hit for monomerid = 50280836
TargetInositol monophosphatase 1(Bos taurus)
TBA
Curated by ChEMBL
LigandPNGBDBM50280836(CHEMBL56834 | Phosphoric acid mono-((1S,2R,3R)-2-h...)
Affinity DataIC50:  2.10E+6nM. Assay description: Tested for the inhibitory activity against bovine inositol monophosphatase by measuring concentration inhibiting the production of [14C]-inositol fro...
In DepthDetails Article