BDBM50281125 2,2,2-Trifluoro-1-m-tolyl-ethanone::CHEMBL86868
SMILES Cc1cccc(c1)C(=O)C(F)(F)F
InChI Key InChIKey=NOHRMVQCINHTNH-UHFFFAOYSA-N
Data  1 KI
  Tab Delimited (TSV)   2D SDfile   Computed 3D by Vconf -m prep SDfile
Find this compound or compounds like it in BindingDB:
Activity Spreadsheet -- Enzyme Inhibition Constant Data from BindingDB
Found 1 hit for monomerid = 50281125
TargetAcetylcholinesterase(Tetronarce californica (Pacific electric ray) (Tor...)
TBA
Curated by ChEMBL
LigandPNGBDBM50281125(2,2,2-Trifluoro-1-m-tolyl-ethanone | CHEMBL86868)
Affinity DataKi:  2.40nM. Assay description: Tested for the ability to inhibit Acetylcholinesterase (AChE) from Torpedo californica
In DepthDetails Article